BDBM50326462 2'-Fluoro-3,3',5-trimethoxybiphenyl-4-ol::CHEMBL1241434
SMILES COc1cccc(c1F)-c1cc(OC)c(O)c(OC)c1
InChI Key InChIKey=JNBLBZWTQYVWFG-UHFFFAOYSA-N
Data  1 IC50
  Tab Delimited (TSV)   2D SDfile   Computed 3D by Vconf -m prep SDfile
Find this compound or compounds like it in BindingDB:
Activity Spreadsheet -- Enzyme Inhibition Constant Data from BindingDB
Found 1 hit for monomerid = 50326462
TargetPolyphenol oxidase 2(Agaricus bisporus (Common mushroom))
Jinan University
Curated by ChEMBL
LigandPNGBDBM50326462(2'-Fluoro-3,3',5-trimethoxybiphenyl-4-ol | CHEMBL1...)
Affinity DataIC50:  6.00E+4nM. Assay description: Inhibition of mushroom tyrosinase after 30 mins
In DepthDetails ArticlePubMed