BDBM50326463 3',4'-Difluoro-3,5-dimethoxybiphenyl-4-ol::CHEMBL1241433
SMILES COc1cc(cc(OC)c1O)-c1ccc(F)c(F)c1
InChI Key InChIKey=NEQYISUFGBAHQA-UHFFFAOYSA-N
Data  1 IC50
  Tab Delimited (TSV)   2D SDfile   Computed 3D by Vconf -m prep SDfile
Find this compound or compounds like it in BindingDB:
Activity Spreadsheet -- Enzyme Inhibition Constant Data from BindingDB
Found 1 hit for monomerid = 50326463
TargetPolyphenol oxidase 2(Agaricus bisporus (Common mushroom))
Jinan University
Curated by ChEMBL
LigandPNGBDBM50326463(3',4'-Difluoro-3,5-dimethoxybiphenyl-4-ol | CHEMBL...)
Affinity DataIC50:  7.00E+4nM. Assay description: Inhibition of mushroom tyrosinase after 30 mins
In DepthDetails ArticlePubMed