BDBM50326742 (3S,3aR,4S,6S,6aR,7S,8S,9bS)-6-acetoxy-3,3a,4-trihydroxy-3,6,9-trimethyl-8-((Z)-2-methylbut-2-enoyloxy)-2-oxo-2,3,3a,4,5,6,6a,7,8,9b-decahydroazuleno[4,5-b]furan-7-yl octanoate::CHEMBL1253562
SMILES CCCCCCCC(=O)O[C@@H]1[C@@H](OC(=O)C(\C)=C/C)C(C)=C2[C@@H]3OC(=O)[C@@](C)(O)[C@@]3(O)[C@@H](O)C[C@](C)(OC(C)=O)[C@@H]12
InChI Key InChIKey=UBPDDZPGODTCDF-CQDUWLBUSA-N
Data  1 IC50  1 Kd
  Tab Delimited (TSV)   2D SDfile   Computed 3D by Vconf -m prep SDfile
Find this compound or compounds like it in BindingDB:
Activity Spreadsheet -- Enzyme Inhibition Constant Data from BindingDB
Found 2 hits for monomerid = 50326742
TargetSarcoplasmic/endoplasmic reticulum calcium ATPase 1(Oryctolagus cuniculus)
University Of Copenhagen
Curated by ChEMBL
LigandPNGBDBM50326742((3S,3aR,4S,6S,6aR,7S,8S,9bS)-6-acetoxy-3,3a,4-trih...)
Affinity DataKd:  10nM. Assay description: Binding affinity to SERCA1a in sarcoplasmic reticulum vesicles of rabbit skeletal muscle after 2.5 to 6 mins by spectrophotometric analysis
In DepthDetails ArticlePubMed
TargetSarcoplasmic/endoplasmic reticulum calcium ATPase 1(Oryctolagus cuniculus)
University Of Copenhagen
Curated by ChEMBL
LigandPNGBDBM50326742((3S,3aR,4S,6S,6aR,7S,8S,9bS)-6-acetoxy-3,3a,4-trih...)
Affinity DataIC50:  10nM. Assay description: Inhibition of rabbit sarcoplasmic reticulum calcium ATPase by ATP regeneration assay
In DepthDetails ArticlePubMed