BDBM50327919 3-[4-(4-Methyl-piperazin-1-yl)-benzoylamino]-1H-thieno[3,2-c]pyrazole-5-carboxylic acid ethylamide::CHEMBL1258114
SMILES CCNC(=O)c1cc2n[nH]c(NC(=O)c3ccc(cc3)N3CCN(C)CC3)c2s1
InChI Key InChIKey=DZGPQCOEPODXIA-UHFFFAOYSA-N
Data  1 IC50
  Tab Delimited (TSV)   2D SDfile   Computed 3D by Vconf -m prep SDfile
Find this compound or compounds like it in BindingDB:
Activity Spreadsheet -- Enzyme Inhibition Constant Data from BindingDB
Found 1 hit for monomerid = 50327919
TargetAurora kinase A(Homo sapiens (Human))
Nerviano Medical Sciences Oncology
Curated by ChEMBL
LigandPNGBDBM50327919(3-[4-(4-Methyl-piperazin-1-yl)-benzoylamino]-1H-th...)
Affinity DataIC50:  48nM. Assay description: Inhibition of AurA
In DepthDetails ArticlePubMed