BDBM50328150 6-(3-aminophenyl)-N-(4-(trifluoromethoxy)phenyl)pyrimidin-4-amine::CHEMBL1257191
SMILES Nc1cccc(c1)-c1cc(Nc2ccc(OC(F)(F)F)cc2)ncn1
InChI Key InChIKey=KDEGUYUJEUYQJV-UHFFFAOYSA-N
Data  1 EC50
  Tab Delimited (TSV)   2D SDfile   Computed 3D by Vconf -m prep SDfile
Find this compound or compounds like it in BindingDB:
Activity Spreadsheet -- Enzyme Inhibition Constant Data from BindingDB
Found 1 hit for monomerid = 50328150
TargetBreakpoint cluster region protein/Tyrosine-protein kinase ABL1(Homo sapiens (Human))
Harvard Medical School
Curated by ChEMBL
LigandPNGBDBM50328150(6-(3-aminophenyl)-N-(4-(trifluoromethoxy)phenyl)py...)
Affinity DataEC50:  330nM. Assay description: Inhibition of Bcr-Abl in mouse BA/F3 cells
In DepthDetails ArticlePubMed