BDBM50328655 (3-chloro-4-fluorophenyl)(4-hydroxy-4-(((5-methylpyridin-2-yl)methylamino)methyl)piperidin-1-yl)methanone::CHEMBL1259155
SMILES Cc1ccc(CNCC2(O)CCN(CC2)C(=O)c2ccc(F)c(Cl)c2)nc1
InChI Key InChIKey=BMRVQIPUGJZZJK-UHFFFAOYSA-N
Data  1 EC50
  Tab Delimited (TSV)   2D SDfile   Computed 3D by Vconf -m prep SDfile
Find this compound or compounds like it in BindingDB:
Activity Spreadsheet -- Enzyme Inhibition Constant Data from BindingDB
Found 1 hit for monomerid = 50328655
Target5-hydroxytryptamine receptor 1A(Homo sapiens (Human))
Friedrich-Alexander University
Curated by ChEMBL
LigandPNGBDBM50328655((3-chloro-4-fluorophenyl)(4-hydroxy-4-(((5-methylp...)
Affinity DataEC50:  6.60nM. Assay description: Intrinsic activity at human 5-HT1A receptor expressed in CHO cells assessed as increase of serotonin-induced [35S]GTPgammaS binding
In DepthDetails ArticlePubMed