BDBM50328821 1-amino-9,10-dioxo-4-(3-sulfamoylphenylamino)-9,10-dihydroanthracene-2-sulfonamide::1-amino-9,10-dioxo-4-(3-sulfamoylphenylamino)-9,10-dihydroanthracene-2-sulfonic acid::CHEMBL471225::NSC-117079
SMILES Nc1c2C(=O)c3ccccc3C(=O)c2c(Nc2cccc(c2)S(N)(=O)=O)cc1S(O)(=O)=O
InChI Key InChIKey=LHSBZAWDPSTOEY-UHFFFAOYSA-N
Data  1 IC50
  Tab Delimited (TSV)   2D SDfile   Computed 3D by Vconf -m prep SDfile
Find this compound or compounds like it in BindingDB:
Activity Spreadsheet -- Enzyme Inhibition Constant Data from BindingDB
Found 1 hit for monomerid = 50328821
TargetPH domain leucine-rich repeat-containing protein phosphatase 2(Homo sapiens (Human))
University Of California San Diego
Curated by ChEMBL
LigandPNGBDBM50328821(1-amino-9,10-dioxo-4-(3-sulfamoylphenylamino)-9,10...)
Affinity DataIC50:  4.00E+3nM. Assay description: Inhibition of PHLPP2 phosphatase domain expressed in Escherichia coli
In DepthDetails ArticlePubMed