BDBM50329333 2-(3-fluorobenzamido)-N-(3-methoxybenzyl)-1-(3-methoxypropyl)-1H-benzo[d]imidazole-5-carboxamide::CHEMBL1270005
SMILES COCCCn1c(NC(=O)c2cccc(F)c2)nc2cc(ccc12)C(=O)NCc1cccc(OC)c1
InChI Key InChIKey=BBDOSUQKJCSRRE-UHFFFAOYSA-N
Data  1 KI
  Tab Delimited (TSV)   2D SDfile   Computed 3D by Vconf -m prep SDfile
Find this compound or compounds like it in BindingDB:
Activity Spreadsheet -- Enzyme Inhibition Constant Data from BindingDB
Found 1 hit for monomerid = 50329333
TargetAdenosine receptor A2a(Homo sapiens (Human))
Ligand Pharmaceuticals
Curated by ChEMBL
LigandPNGBDBM50329333(2-(3-fluorobenzamido)-N-(3-methoxybenzyl)-1-(3-met...)
Affinity DataKi:  210nM. Assay description: Displacement of [3H]SCH58261 from human recombinant A2A receptor expressed in HEK293 cells
In DepthDetails ArticlePubMed