BDBM50329846 3-(3-Carboxybenzyl)-6-(cyclopropylmethoxy)-1-[(6-ethylbenzo[d][1,3]dioxol-5-yl)methyl]-4-oxo-1,4-dihydroquinoline-2-carboxylic acid::CHEMBL1271746
SMILES CCc1cc2OCOc2cc1Cn1c(C(O)=O)c(Cc2cccc(c2)C(O)=O)c(=O)c2cc(OCC3CC3)ccc12
InChI Key InChIKey=HXUVUUFEMYJLDB-UHFFFAOYSA-N
Data  3 IC50
  Tab Delimited (TSV)   2D SDfile   Computed 3D by Vconf -m prep SDfile
Find this compound or compounds like it in BindingDB:
Activity Spreadsheet -- Enzyme Inhibition Constant Data from BindingDB
Found 3 hits for monomerid = 50329846
TargetEndothelin-1 receptor(Homo sapiens (Human))
St. John'S University
Curated by ChEMBL
LigandPNGBDBM50329846(3-(3-Carboxybenzyl)-6-(cyclopropylmethoxy)-1-[(6-e...)
Affinity DataIC50:  116nM. Assay description: Displacement of [125I]ET1 from ETA receptor expressed in african green monkey CCL-81 cells monolayer
In DepthDetails ArticlePubMed
TargetEndothelin-1 receptor(Homo sapiens (Human))
St. John'S University
Curated by ChEMBL
LigandPNGBDBM50329846(3-(3-Carboxybenzyl)-6-(cyclopropylmethoxy)-1-[(6-e...)
Affinity DataIC50:  121nM. Assay description: Antagonist activity at ETA receptor (unknown origin) expressed in HEK293T cells measured after 30 mins by CCF4-AM dye based GeneBlazer FRET assay
In DepthDetails ArticlePubMed
TargetEndothelin receptor type B(Homo sapiens (Human))
St. John'S University
Curated by ChEMBL
LigandPNGBDBM50329846(3-(3-Carboxybenzyl)-6-(cyclopropylmethoxy)-1-[(6-e...)
Affinity DataIC50:  856nM. Assay description: Antagonist activity at ETB receptor (unknown origin) expressed in HEK293T cells measured after 30 mins by CCF4-AM dye based GeneBlazer FRET assay
In DepthDetails ArticlePubMed