BDBM50330863 CHEMBL1278131::trans rac-4-methyl-6-((4-(3-phenylpropylamino)pyrrolidin-3-yl)methyl)pyridin-2-amine
SMILES Cc1cc(N)nc(C[C@H]2CNC[C@@H]2NCCCc2ccccc2)c1
InChI Key InChIKey=PNXSKAKPXJMELL-HKUYNNGSSA-N
Data  3 KI
  Tab Delimited (TSV)   2D SDfile   Computed 3D by Vconf -m prep SDfile
Find this compound or compounds like it in BindingDB:
Activity Spreadsheet -- Enzyme Inhibition Constant Data from BindingDB
Found 3 hits for monomerid = 50330863
TargetNitric oxide synthase, inducible(Mus musculus (mouse))
Northwestern University
Curated by ChEMBL
LigandPNGBDBM50330863(CHEMBL1278131 | trans rac-4-methyl-6-((4-(3-phenyl...)
Affinity DataKi:  1.33E+4nM. Assay description: Inhibition of mouse recombinant iNOS
In DepthDetails ArticlePubMed
TargetNitric oxide synthase, endothelial(Bos taurus (bovine))
Northwestern University
Curated by ChEMBL
LigandPNGBDBM50330863(CHEMBL1278131 | trans rac-4-methyl-6-((4-(3-phenyl...)
Affinity DataKi:  8.52E+4nM. Assay description: Inhibition of bovine recombinant eNOS
In DepthDetails ArticlePubMed
TargetNitric oxide synthase, brain(Rattus norvegicus (rat))
Northwestern University
Curated by ChEMBL
LigandPNGBDBM50330863(CHEMBL1278131 | trans rac-4-methyl-6-((4-(3-phenyl...)
Affinity DataKi:  1.44E+5nM. Assay description: Inhibition of rat recombinant nNOS
In DepthDetails ArticlePubMed