BDBM50330969 2-(3,4-dihydroxyphenyl)-7-hydroxy-4-oxo-4H-chromen-5-ylbenzoate::CHEMBL1277609
SMILES Oc1cc(OC(=O)c2ccccc2)c2c(c1)oc(cc2=O)-c1ccc(O)c(O)c1
InChI Key InChIKey=QTDXUYYBTJTRHA-UHFFFAOYSA-N
Data  1 EC50
  Tab Delimited (TSV)   2D SDfile   Computed 3D by Vconf -m prep SDfile
Find this compound or compounds like it in BindingDB:
Activity Spreadsheet -- Enzyme Inhibition Constant Data from BindingDB
Found 1 hit for monomerid = 50330969
TargetSodium-dependent dopamine transporter(Rattus norvegicus (rat))
Zhengzhou University
Curated by ChEMBL
LigandPNGBDBM50330969(2-(3,4-dihydroxyphenyl)-7-hydroxy-4-oxo-4H-chromen...)
Affinity DataEC50:  1.12E+4nM. Assay description: Agonist activity at rat DAT expressed in CHO cells
In DepthDetails ArticlePubMed