BDBM50330970 2-(3,4-dihydroxyphenyl)-7-hydroxy-4-oxo-4H-chromen-5-yl4-methylben-zoate::CHEMBL1277610
SMILES Cc1ccc(cc1)C(=O)Oc1cc(O)cc2oc(cc(=O)c12)-c1ccc(O)c(O)c1
InChI Key InChIKey=LDYNATLHPFCQHO-UHFFFAOYSA-N
Data  1 EC50
  Tab Delimited (TSV)   2D SDfile   Computed 3D by Vconf -m prep SDfile
Find this compound or compounds like it in BindingDB:
Activity Spreadsheet -- Enzyme Inhibition Constant Data from BindingDB
Found 1 hit for monomerid = 50330970
TargetSodium-dependent dopamine transporter(Rattus norvegicus (rat))
Zhengzhou University
Curated by ChEMBL
LigandPNGBDBM50330970(2-(3,4-dihydroxyphenyl)-7-hydroxy-4-oxo-4H-chromen...)
Affinity DataEC50:  6.92E+3nM. Assay description: Agonist activity at rat DAT expressed in CHO cells
In DepthDetails ArticlePubMed