BDBM50330980 5-(decyloxy)-2-(3,4-dihydroxyphenyl)-7-hy-droxy-4H-chromen-4-one::CHEMBL1277961
SMILES CCCCCCCCCCOc1cc(O)cc2oc(cc(=O)c12)-c1ccc(O)c(O)c1
InChI Key InChIKey=XTDXIQVUZXPAEE-UHFFFAOYSA-N
Data  1 EC50
  Tab Delimited (TSV)   2D SDfile   Computed 3D by Vconf -m prep SDfile
Find this compound or compounds like it in BindingDB:
Activity Spreadsheet -- Enzyme Inhibition Constant Data from BindingDB
Found 1 hit for monomerid = 50330980
TargetSodium-dependent dopamine transporter(Rattus norvegicus (rat))
Zhengzhou University
Curated by ChEMBL
LigandPNGBDBM50330980(5-(decyloxy)-2-(3,4-dihydroxyphenyl)-7-hy-droxy-4H...)
Affinity DataEC50:  3.30E+4nM. Assay description: Agonist activity at rat DAT expressed in CHO cells
In DepthDetails ArticlePubMed