BDBM50330981 2-(3,4-dihydroxyphenyl)-7-hydroxy-5-(4-ph-enylbutoxy)-4H-chromen-4-one::CHEMBL1278046
SMILES Oc1cc(OCCCCc2ccccc2)c2c(c1)oc(cc2=O)-c1ccc(O)c(O)c1
InChI Key InChIKey=KJQHIKKEHGVZBA-UHFFFAOYSA-N
Data  1 EC50
  Tab Delimited (TSV)   2D SDfile   Computed 3D by Vconf -m prep SDfile
Find this compound or compounds like it in BindingDB:
Activity Spreadsheet -- Enzyme Inhibition Constant Data from BindingDB
Found 1 hit for monomerid = 50330981
TargetSodium-dependent dopamine transporter(Rattus norvegicus (rat))
Zhengzhou University
Curated by ChEMBL
LigandPNGBDBM50330981(2-(3,4-dihydroxyphenyl)-7-hydroxy-5-(4-ph-enylbuto...)
Affinity DataEC50:  2.59E+3nM. Assay description: Agonist activity at rat DAT expressed in CHO cells
In DepthDetails ArticlePubMed