BDBM50331326 (E)-4-(2-(thiophen-2-yl)vinyl)benzenesulfonamide::CHEMBL1288801
SMILES NS(=O)(=O)c1ccc(\C=C\c2cccs2)cc1
InChI Key InChIKey=OZEBJQJPQRQDDH-ZZXKWVIFSA-N
Data  1 IC50
  Tab Delimited (TSV)   2D SDfile   Computed 3D by Vconf -m prep SDfile
Find this compound or compounds like it in BindingDB:
Activity Spreadsheet -- Enzyme Inhibition Constant Data from BindingDB
Found 1 hit for monomerid = 50331326
TargetProstaglandin G/H synthase 2(Mus musculus (Mouse))
Seoul National University
Curated by ChEMBL
LigandPNGBDBM50331326((E)-4-(2-(thiophen-2-yl)vinyl)benzenesulfonamide |...)
Affinity DataIC50:  13nM. Assay description: Inhibition of COX-2 mediated PGE2 production in LPS-induced mouse RAW264.7 cells
In DepthDetails ArticlePubMed