BDBM50331517 CHEMBL1290741::Ethyl 4-biphenyl-4-yl-piperidine-4-carboxylate hydrochloride
SMILES CCOC(=O)C1(CCNCC1)c1ccc(cc1)-c1ccccc1
InChI Key InChIKey=SMTOUNAUSYRLQD-UHFFFAOYSA-N
Data  2 KI
  Tab Delimited (TSV)   2D SDfile   Computed 3D by Vconf -m prep SDfile
Find this compound or compounds like it in BindingDB:
Activity Spreadsheet -- Enzyme Inhibition Constant Data from BindingDB
Found 2 hits for monomerid = 50331517
TargetSodium-dependent serotonin transporter(Rattus norvegicus (rat))
University Of New Orleans
Curated by ChEMBL
LigandPNGBDBM50331517(CHEMBL1290741 | Ethyl 4-biphenyl-4-yl-piperidine-4...)
Affinity DataKi:  3.30nM. Assay description: Displacement of [3H]citalopram from serotonin transporter in Sprague-Dawley rat brain after 1 hr by liquid scintillation counting
In DepthDetails ArticlePubMed
TargetSodium-dependent dopamine transporter(Rattus norvegicus (rat))
University Of New Orleans
Curated by ChEMBL
LigandPNGBDBM50331517(CHEMBL1290741 | Ethyl 4-biphenyl-4-yl-piperidine-4...)
Affinity DataKi:  3.21E+3nM. Assay description: Displacement of [3H]WIN 35428 from dopamine transporter in Sprague-Dawley rat brain after 1 hr by liquid scintillation counting
In DepthDetails ArticlePubMed