BDBM50332268 (R)-5-((6-methoxy-1-oxoisoindolin-2-yl)methyl)-5-(m-tolylethynyl)imidazolidine-2,4-dione::CHEMBL1288091
SMILES COc1ccc2CN(C[C@]3(NC(=O)NC3=O)C#Cc3cccc(C)c3)C(=O)c2c1
InChI Key InChIKey=LUWQGOYLKPARQB-JOCHJYFZSA-N
Data  1 KI
  Tab Delimited (TSV)   2D SDfile   Computed 3D by Vconf -m prep SDfile
Find this compound or compounds like it in BindingDB:
Activity Spreadsheet -- Enzyme Inhibition Constant Data from BindingDB
Found 1 hit for monomerid = 50332268
TargetDisintegrin and metalloproteinase domain-containing protein 17(Homo sapiens (Human))
Merck Research Laboratories
Curated by ChEMBL
LigandPNGBDBM50332268((R)-5-((6-methoxy-1-oxoisoindolin-2-yl)methyl)-5-(...)
Affinity DataKi:  0.720nM. Assay description: Inhibition of TACE
In DepthDetails ArticlePubMed