BDBM50332274 (R)-N-cyclopropyl-4-((4-((6-methoxy-1-oxoisoindolin-2-yl)methyl)-2,5-dioxoimidazolidin-4-yl)ethynyl)benzamide::CHEMBL1288183
SMILES COc1ccc2CN(C[C@]3(NC(=O)NC3=O)C#Cc3ccc(cc3)C(=O)NC3CC3)C(=O)c2c1
InChI Key InChIKey=XMKMZXIRNBFMBB-RUZDIDTESA-N
Data  1 KI
  Tab Delimited (TSV)   2D SDfile   Computed 3D by Vconf -m prep SDfile
Find this compound or compounds like it in BindingDB:
Activity Spreadsheet -- Enzyme Inhibition Constant Data from BindingDB
Found 1 hit for monomerid = 50332274
TargetDisintegrin and metalloproteinase domain-containing protein 17(Homo sapiens (Human))
Merck Research Laboratories
Curated by ChEMBL
LigandPNGBDBM50332274((R)-N-cyclopropyl-4-((4-((6-methoxy-1-oxoisoindoli...)
Affinity DataKi:  2.60nM. Assay description: Inhibition of TACE
In DepthDetails ArticlePubMed