BDBM50332611 (4-Methyl-3-(methyl(7H-pyrrolo[2,3-d]pyrimidin-4-yl)amino)-piperidin-1-yl)(tetrahydrofuran-3-yl)methanone::CHEMBL1630797
SMILES CC1CCN(CC1N(C)c1ncnc2[nH]ccc12)C(=O)C1CCOC1
InChI Key InChIKey=IGNOXKOLEZVMMV-UHFFFAOYSA-N
Data  2 IC50
  Tab Delimited (TSV)   2D SDfile   Computed 3D by Vconf -m prep SDfile
Find this compound or compounds like it in BindingDB:
Activity Spreadsheet -- Enzyme Inhibition Constant Data from BindingDB
Found 2 hits for monomerid = 50332611
TargetTyrosine-protein kinase JAK3(Homo sapiens (Human))
Pfizer
Curated by ChEMBL
LigandPNGBDBM50332611((4-Methyl-3-(methyl(7H-pyrrolo[2,3-d]pyrimidin-4-y...)
Affinity DataIC50:  40nM. Assay description: Inhibition of GST-tagged human JAK3 catalytic domain expressed in Sf9 cells by ELISA
In DepthDetails ArticlePubMed
TargetTyrosine-protein kinase JAK1(Homo sapiens (Human))
Pfizer
Curated by ChEMBL
LigandPNGBDBM50332611((4-Methyl-3-(methyl(7H-pyrrolo[2,3-d]pyrimidin-4-y...)
Affinity DataIC50: >1.00E+4nM. Assay description: Inhibition of GST-tagged human JAK1 catalytic domain expressed in Sf9 cells by ELISA
In DepthDetails ArticlePubMed