BDBM50333655 4-oxo-N-p-tolyl-4H-chromene-3-carboxamide::CHEMBL1643124
SMILES Cc1ccc(NC(=O)c2coc3ccccc3c2=O)cc1
InChI Key InChIKey=ZPHGXJAOXHSRAX-UHFFFAOYSA-N
Data  3 IC50
  Tab Delimited (TSV)   2D SDfile   Computed 3D by Vconf -m prep SDfile
Find this compound or compounds like it in BindingDB:
Activity Spreadsheet -- Enzyme Inhibition Constant Data from BindingDB
Found 3 hits for monomerid = 50333655
TargetAmine oxidase [flavin-containing] B(Homo sapiens (Human))
Universidade Do Porto
Curated by ChEMBL
LigandPNGBDBM50333655(4-oxo-N-p-tolyl-4H-chromene-3-carboxamide | CHEMBL...)
Affinity DataIC50:  68nM. Assay description: Inhibition of human recombinant MAOB expressed in baculovirus-infected BTI insect cells after 15 mins by fluorimetric assay
In DepthDetails ArticlePubMed
TargetAmine oxidase [flavin-containing] B(Homo sapiens (Human))
Universidade Do Porto
Curated by ChEMBL
LigandPNGBDBM50333655(4-oxo-N-p-tolyl-4H-chromene-3-carboxamide | CHEMBL...)
Affinity DataIC50:  7.90nM. Assay description: Inhibition of human microsomal MAO-B expressed in recombinant baculovirus infected insect BTI-TN-5B1-4 cells assessed as reduction in H2O2 production...
In DepthDetails ArticlePubMed
TargetAmine oxidase [flavin-containing] B(Homo sapiens (Human))
Universidade Do Porto
Curated by ChEMBL
LigandPNGBDBM50333655(4-oxo-N-p-tolyl-4H-chromene-3-carboxamide | CHEMBL...)
Affinity DataIC50:  8nM. Assay description: Inhibition of human microsomal MAO-B expressed in recombinant baculovirus infected insect BTI-TN-5B1-4 cells assessed as reduction in H2O2 production...
In DepthDetails ArticlePubMed