BDBM50333970 CHEMBL1644603::exo-(1R,5S)-3-(5-fluorobiphenyl-3-yloxy)-8-azabicyclo[3.2.1]octane
SMILES Fc1cc(O[C@H]2C[C@@H]3CC[C@H](C2)N3)cc(c1)-c1ccccc1
InChI Key InChIKey=NPRIIPJXYKFSOJ-IZZQQSIFSA-N
Data  3 IC50
  Tab Delimited (TSV)   2D SDfile   Computed 3D by Vconf -m prep SDfile
Find this compound or compounds like it in BindingDB:
Activity Spreadsheet -- Enzyme Inhibition Constant Data from BindingDB
Found 3 hits for monomerid = 50333970
TargetSodium-dependent noradrenaline transporter(Homo sapiens (Human))
Msd
Curated by ChEMBL
LigandPNGBDBM50333970(CHEMBL1644603 | exo-(1R,5S)-3-(5-fluorobiphenyl-3-...)
Affinity DataIC50:  85nM. Assay description: Inhibition of [3H]noradrenalin reuptake at NET expressed in MDCK cells scintillation counting
In DepthDetails ArticlePubMed
TargetSodium-dependent dopamine transporter(Homo sapiens (Human))
Msd
Curated by ChEMBL
LigandPNGBDBM50333970(CHEMBL1644603 | exo-(1R,5S)-3-(5-fluorobiphenyl-3-...)
Affinity DataIC50:  8.71E+3nM. Assay description: Inhibition of [3H]dopamine reuptake at DAT expressed in HEK293 cells scintillation counting
In DepthDetails ArticlePubMed
TargetSodium-dependent serotonin transporter(Homo sapiens (Human))
Msd
Curated by ChEMBL
LigandPNGBDBM50333970(CHEMBL1644603 | exo-(1R,5S)-3-(5-fluorobiphenyl-3-...)
Affinity DataIC50:  905nM. Assay description: Inhibition of [3H]serotonin reuptake at SERT expressed in HEK293 cells scintillation counting
In DepthDetails ArticlePubMed