BDBM50335493 5-Phenylpyridin-2-ylmethylphosphonic acid::CHEMBL1615246::[(5-phenylpyridin-2-yl)methyl]phosphonic acid
SMILES OP(O)(=O)Cc1ccc(cn1)-c1ccccc1
InChI Key InChIKey=JTYLHYFDHHMHKD-UHFFFAOYSA-N
Data  1 KI  1 IC50
PDB links: 1 PDB ID matches this monomer.
  Tab Delimited (TSV)   2D SDfile   Computed 3D by Vconf -m prep SDfile
Find this compound or compounds like it in BindingDB:
Activity Spreadsheet -- Enzyme Inhibition Constant Data from BindingDB
Found 1 hit for monomerid = 50335493
Target1-deoxy-D-xylulose 5-phosphate reductoisomerase(Mycobacterium tuberculosis)
Baylor College Of Medicine
Curated by ChEMBL
LigandPNGBDBM50335493(5-Phenylpyridin-2-ylmethylphosphonic acid | CHEMBL...)
Affinity DataKi:  3.20E+3nM. Assay description: Inhibition of Mycobacterium tuberculosis recombinant DXR expressed in Escherichia coli BL21 (DE3) using DXP as substrate and MgCl2 as cofactor preinc...
In DepthDetails ArticlePubMed