BDBM50335925 5-(2'-(1H-tetrazol-5-yl)biphenyl-4-yl)-3-butyl-1-chloro-5,6-dihydroimidazo[1,5-a]pyridine-7-carboxylic acid::CHEMBL1668008
SMILES CCCCc1nc(Cl)c2C=C(CC(c3ccc(cc3)-c3ccccc3-c3nnn[nH]3)n12)C(O)=O
InChI Key InChIKey=OLJPFLDDHJGATF-UHFFFAOYSA-N
Data  1 IC50
  Tab Delimited (TSV)   2D SDfile   Computed 3D by Vconf -m prep SDfile
Find this compound or compounds like it in BindingDB:
Activity Spreadsheet -- Enzyme Inhibition Constant Data from BindingDB
Found 1 hit for monomerid = 50335925
TargetType-2 angiotensin II receptor(Homo sapiens (Human))
The M. S. University Of Baroda
Curated by ChEMBL
LigandPNGBDBM50335925(5-(2'-(1H-tetrazol-5-yl)biphenyl-4-yl)-3-butyl-1-c...)
Affinity DataIC50:  10nM. Assay description: Binding affinity to angiotensin AT2 receptor
In DepthDetails ArticlePubMed