BDBM50336496 2-aminocycloheptanone hydrochloride::CHEMBL1668627
SMILES NC1CCCCCC1=O
InChI Key InChIKey=AGGSGTDKCCRCNB-UHFFFAOYSA-N
Data  2 IC50
  Tab Delimited (TSV)   2D SDfile   Computed 3D by Vconf -m prep SDfile
Find this compound or compounds like it in BindingDB:
Activity Spreadsheet -- Enzyme Inhibition Constant Data from BindingDB
Found 2 hits for monomerid = 50336496
TargetCytosol aminopeptidase(Bos taurus (bovine))
Merck Sharpe And Dohme
Curated by ChEMBL
LigandPNGBDBM50336496(2-aminocycloheptanone hydrochloride | CHEMBL166862...)
Affinity DataIC50: >1.00E+5nM. Assay description: Inhibition of bovine lens cytosolic leucine aminopeptidase by Dixon plot analysis
In DepthDetails ArticlePubMed
TargetAminopeptidase N(Homo sapiens (Human))
Merck Sharpe And Dohme
Curated by ChEMBL
LigandPNGBDBM50336496(2-aminocycloheptanone hydrochloride | CHEMBL166862...)
Affinity DataIC50:  3.10E+5nM. Assay description: Inhibition of human aminopeptidase N by Dixon plot analysis
In DepthDetails ArticlePubMed