BDBM50336551 5-(6-Aminopurin-9-yl)-4-bromocyclopent-3-ene-1,2-diol::CHEMBL1672012
SMILES Nc1ncnc2n(cnc12)[C@H]1[C@H](O)[C@H](O)C=C1Br
InChI Key InChIKey=BVJHJHDQBBUSSU-LPBLVHEISA-N
Data  1 IC50
  Tab Delimited (TSV)   2D SDfile   Computed 3D by Vconf -m prep SDfile
Find this compound or compounds like it in BindingDB:
Activity Spreadsheet -- Enzyme Inhibition Constant Data from BindingDB
Found 1 hit for monomerid = 50336551
TargetAdenosylhomocysteinase(Homo sapiens (Human))
Ewha Womans University
Curated by ChEMBL
LigandPNGBDBM50336551(5-(6-Aminopurin-9-yl)-4-bromocyclopent-3-ene-1,2-d...)
Affinity DataIC50: >1.00E+6nM. Assay description: Inhibition of human placental AdoHcy hydrolase expressed in Escherichia coli JM109
In DepthDetails ArticlePubMed