BDBM50337045 (2S,3R,4R,5S,6R)-2-(4-chloro-3-((5-ethylthiazol-2-yl)methyl)phenyl)-6-(hydroxymethyl)-tetrahydro-2H-pyran-3,4,5-triol::CHEMBL1672773
SMILES CCc1cnc(Cc2cc(ccc2Cl)[C@@H]2O[C@H](CO)[C@@H](O)[C@H](O)[C@H]2O)s1
InChI Key InChIKey=ZUBRFFJWNWKMRB-LHKMKVQPSA-N
Data  1 IC50
  Tab Delimited (TSV)   2D SDfile   Computed 3D by Vconf -m prep SDfile
Find this compound or compounds like it in BindingDB:
Activity Spreadsheet -- Enzyme Inhibition Constant Data from BindingDB
Found 1 hit for monomerid = 50337045
TargetSodium/glucose cotransporter 2(Homo sapiens (Human))
TBA
Curated by ChEMBL
LigandPNGBDBM50337045((2S,3R,4R,5S,6R)-2-(4-chloro-3-((5-ethylthiazol-2-...)
Affinity DataIC50:  16.7nM. Assay description: Inhibition of human SGLT2 expressed in CHO cells assessed as [14C]-alpha-methyl-D-glucopyranoside uptake after 2 hrs by liquid scintillation counting
In DepthDetails ArticlePubMed