BDBM50337063 (2S,3R,4R,5S,6R)-2-(4-chloro-3-((5-phenylthiazol-2-yl)methyl)phenyl)-6-(hydroxymethyl)tetrahydro-2H-pyran-3,4,5-triol::CHEMBL1672791
SMILES OC[C@H]1O[C@H]([C@H](O)[C@@H](O)[C@@H]1O)c1ccc(Cl)c(Cc2ncc(s2)-c2ccccc2)c1
InChI Key InChIKey=UDRCKFIYUBJBAB-OSKXVONFSA-N
Data  1 IC50
  Tab Delimited (TSV)   2D SDfile   Computed 3D by Vconf -m prep SDfile
Find this compound or compounds like it in BindingDB:
Activity Spreadsheet -- Enzyme Inhibition Constant Data from BindingDB
Found 1 hit for monomerid = 50337063
TargetSodium/glucose cotransporter 2(Homo sapiens (Human))
TBA
Curated by ChEMBL
LigandPNGBDBM50337063((2S,3R,4R,5S,6R)-2-(4-chloro-3-((5-phenylthiazol-2...)
Affinity DataIC50:  13.3nM. Assay description: Inhibition of human SGLT2 expressed in CHO cells assessed as [14C]-alpha-methyl-D-glucopyranoside uptake after 2 hrs by liquid scintillation counting
In DepthDetails ArticlePubMed