BDBM50337082 (2S,3R,4R,5S,6R)-2-(3-((5-(Furan-2-yl)thiazol-2-yl)methyl)phenyl)-6-(hydroxymethyl)-tetrahydro-2H-pyran-3,4,5-triol::CHEMBL1672810
SMILES OC[C@H]1O[C@H]([C@H](O)[C@@H](O)[C@@H]1O)c1cccc(Cc2ncc(s2)-c2ccco2)c1
InChI Key InChIKey=VAZLGXBKVYVPOA-QSWMPLQWSA-N
Data  1 IC50
  Tab Delimited (TSV)   2D SDfile   Computed 3D by Vconf -m prep SDfile
Find this compound or compounds like it in BindingDB:
Activity Spreadsheet -- Enzyme Inhibition Constant Data from BindingDB
Found 1 hit for monomerid = 50337082
TargetSodium/glucose cotransporter 2(Homo sapiens (Human))
TBA
Curated by ChEMBL
LigandPNGBDBM50337082((2S,3R,4R,5S,6R)-2-(3-((5-(Furan-2-yl)thiazol-2-yl...)
Affinity DataIC50:  22.6nM. Assay description: Inhibition of human SGLT2 expressed in CHO cells assessed as [14C]-alpha-methyl-D-glucopyranoside uptake after 2 hrs by liquid scintillation counting
In DepthDetails ArticlePubMed