BDBM50337086 (2S,3R,4R,5S,6R)-2-(4-Chloro-3-((2-(furan-2-yl)thiazol-5-yl)methyl)phenyl)-6-(hydroxymethyl)tetrahydro-2H-pyran-3,4,5-triol::CHEMBL1672814
SMILES OC[C@H]1O[C@H]([C@H](O)[C@@H](O)[C@@H]1O)c1ccc(Cl)c(Cc2cnc(s2)-c2ccco2)c1
InChI Key InChIKey=GHVLXPCFAZVNCK-FQBWVUSXSA-N
Data  1 IC50
  Tab Delimited (TSV)   2D SDfile   Computed 3D by Vconf -m prep SDfile
Find this compound or compounds like it in BindingDB:
Activity Spreadsheet -- Enzyme Inhibition Constant Data from BindingDB
Found 1 hit for monomerid = 50337086
TargetSodium/glucose cotransporter 2(Homo sapiens (Human))
TBA
Curated by ChEMBL
LigandPNGBDBM50337086((2S,3R,4R,5S,6R)-2-(4-Chloro-3-((2-(furan-2-yl)thi...)
Affinity DataIC50:  1.42nM. Assay description: Inhibition of human SGLT2 expressed in CHO cells assessed as [14C]-alpha-methyl-D-glucopyranoside uptake after 2 hrs by liquid scintillation counting
In DepthDetails ArticlePubMed