BDBM50337195 CHEMBL1684871::GpYLPQTV-NH2
SMILES CC(C)C[C@H](NC(=O)[C@H](Cc1ccc(O)cc1)NC(=O)C1CCCN1C(=O)CN)C(=O)N1CCC[C@H]1C(=O)N[C@@H](CCC(N)=O)C(=O)N[C@@H]([C@H](C)O)C(=O)N[C@@H](C(C)C)C(N)=O
InChI Key InChIKey=WPKWXHIWEVDVDI-YFBIINGWSA-N
Data  1 Kd
  Tab Delimited (TSV)   2D SDfile   Computed 3D by Vconf -m prep SDfile
Find this compound or compounds like it in BindingDB:
Activity Spreadsheet -- Enzyme Inhibition Constant Data from BindingDB
Found 1 hit for monomerid = 50337195
TargetSignal transducer and activator of transcription 3(Mus musculus (mouse))
University Of Toronto
Curated by ChEMBL
LigandPNGBDBM50337195(CHEMBL1684871 | GpYLPQTV-NH2)
Affinity DataKd:  24nM. Assay description: Inhibition of mouse recombinant SH2 domain of His-tagged full-length STAT3 by surface plasmon resonance assay
In DepthDetails ArticlePubMed