BDBM50337860 1-heptylpiperidin-4-yl biphenyl-2-ylcarbamate::CHEMBL1683915
SMILES CCCCCCCN1CCC(CC1)OC(=O)Nc1ccccc1-c1ccccc1
InChI Key InChIKey=DJJGUBUFSOKYKD-UHFFFAOYSA-N
Data  1 KI
  Tab Delimited (TSV)   2D SDfile   Computed 3D by Vconf -m prep SDfile
Find this compound or compounds like it in BindingDB:
Activity Spreadsheet -- Enzyme Inhibition Constant Data from BindingDB
Found 1 hit for monomerid = 50337860
TargetMuscarinic acetylcholine receptor M3(Homo sapiens (Human))
Theravance
Curated by ChEMBL
LigandPNGBDBM50337860(1-heptylpiperidin-4-yl biphenyl-2-ylcarbamate | CH...)
Affinity DataKi:  5.10nM. Assay description: Displacement of [3H]-N-methyl-scopolamine from human muscarinic M3 receptor after 6 hrs by cell based assayChecked by Author
In DepthDetails ArticlePubMed