BDBM50337881 (R)-1-(9-(2-hydroxy-2-(4-hydroxy-3-(hydroxymethyl)phenyl)ethylamino)nonyl)piperidin-4-yl biphenyl-2-ylcarbamate::CHEMBL1683936
SMILES OCc1cc(ccc1O)[C@@H](O)CNCCCCCCCCCN1CCC(CC1)OC(=O)Nc1ccccc1-c1ccccc1
InChI Key InChIKey=DQCFXRWZNALQHV-DHUJRADRSA-N
Data  2 KI  1 EC50
  Tab Delimited (TSV)   2D SDfile   Computed 3D by Vconf -m prep SDfile
Find this compound or compounds like it in BindingDB:
Activity Spreadsheet -- Enzyme Inhibition Constant Data from BindingDB
Found 3 hits for monomerid = 50337881
TargetMuscarinic acetylcholine receptor M3(Homo sapiens (Human))
Theravance
Curated by ChEMBL
LigandPNGBDBM50337881((R)-1-(9-(2-hydroxy-2-(4-hydroxy-3-(hydroxymethyl)...)
Affinity DataKi:  0.140nM. Assay description: Displacement of [3H]-N-methyl-scopolamine from human muscarinic M3 receptor after 6 hrs by cell based assayChecked by Author
In DepthDetails ArticlePubMed
TargetBeta-2 adrenergic receptor(Homo sapiens (Human))
Theravance
Curated by ChEMBL
LigandPNGBDBM50337881((R)-1-(9-(2-hydroxy-2-(4-hydroxy-3-(hydroxymethyl)...)
Affinity DataKi:  61nM. Assay description: Displacement of [3H]-dihydroalprenolol from human beta2-adrenoceptor expressed in HEK cells after 4 hrsChecked by Author
In DepthDetails ArticlePubMed
TargetBeta-2 adrenergic receptor(Homo sapiens (Human))
Theravance
Curated by ChEMBL
LigandPNGBDBM50337881((R)-1-(9-(2-hydroxy-2-(4-hydroxy-3-(hydroxymethyl)...)
Affinity DataEC50:  14nM. Assay description: Agonist activity at human beta2-adrenoceptor expressed in HEK cells assessed as increase of cAMP level after 10 mins by radioimmuno assayChecked by Author
In DepthDetails ArticlePubMed