BDBM50337884 (3R)-3-(biphenyl-2-ylcarbamoyloxy)-1-(9-(2-hydroxy-2-(8-hydroxy-2-oxo-1,2-dihydroquinolin-5-yl)ethylamino)nonyl)-1-azoniabicyclo[2.2.2]octane::CHEMBL1683941
SMILES OC(CNCCCCCCCCC[N+]12CCC(CC1)[C@H](C2)OC(=O)Nc1ccccc1-c1ccccc1)c1ccc(O)c2[nH]c(=O)ccc12
InChI Key InChIKey=OEMAFJPJPSVKLB-PIJVGCKKSA-O
Data  2 KI  1 EC50
  Tab Delimited (TSV)   2D SDfile   Computed 3D by Vconf -m prep SDfile
Find this compound or compounds like it in BindingDB:
Activity Spreadsheet -- Enzyme Inhibition Constant Data from BindingDB
Found 3 hits for monomerid = 50337884
TargetBeta-2 adrenergic receptor(Homo sapiens (Human))
Theravance
Curated by ChEMBL
LigandPNGBDBM50337884((3R)-3-(biphenyl-2-ylcarbamoyloxy)-1-(9-(2-hydroxy...)
Affinity DataKi:  123nM. Assay description: Displacement of [3H]-dihydroalprenolol from human beta2-adrenoceptor expressed in HEK cells after 4 hrsChecked by Author
In DepthDetails ArticlePubMed
TargetMuscarinic acetylcholine receptor M3(Homo sapiens (Human))
Theravance
Curated by ChEMBL
LigandPNGBDBM50337884((3R)-3-(biphenyl-2-ylcarbamoyloxy)-1-(9-(2-hydroxy...)
Affinity DataKi:  140nM. Assay description: Displacement of [3H]-N-methyl-scopolamine from human muscarinic M3 receptor after 6 hrs by cell based assayChecked by Author
In DepthDetails ArticlePubMed
TargetBeta-2 adrenergic receptor(Homo sapiens (Human))
Theravance
Curated by ChEMBL
LigandPNGBDBM50337884((3R)-3-(biphenyl-2-ylcarbamoyloxy)-1-(9-(2-hydroxy...)
Affinity DataEC50:  8.90nM. Assay description: Agonist activity at human beta2-adrenoceptor expressed in HEK cells assessed as increase of cAMP level after 10 mins by radioimmuno assayChecked by Author
In DepthDetails ArticlePubMed