BDBM50338553 6-(-4-((1-(((2S,3R,4S,5S)-5-(6-amino-9H-purin-9-yl)-3,4-dihydroxytetrahydrofuran-2-yl)methyl)-1H-1,2,3-triazol-4-yl)methylamino)-3-methylbut-2-enyl)-7-hydroxy-5-methoxy-4-methylisobenzofuran-1(3H)-one::CHEMBL1683755
SMILES COc1c(C)c2COC(=O)c2c(O)c1C\C=C(/C)CNCc1cn(C[C@@H]2O[C@@H]([C@@H](O)[C@H]2O)n2cnc3c(N)ncnc23)nn1
InChI Key InChIKey=SNFQZPUVORYYMX-ZHDVMFHKSA-N
Data  2 KI
  Tab Delimited (TSV)   2D SDfile   Computed 3D by Vconf -m prep SDfile
Find this compound or compounds like it in BindingDB:
Activity Spreadsheet -- Enzyme Inhibition Constant Data from BindingDB
Found 2 hits for monomerid = 50338553
TargetInosine-5'-monophosphate dehydrogenase 2(Homo sapiens (Human))
University Of Minnesota
Curated by ChEMBL
LigandPNGBDBM50338553(6-(-4-((1-(((2S,3R,4S,5S)-5-(6-amino-9H-purin-9-yl...)
Affinity DataKi:  34nM. Assay description: Inhibition of human IMPDH2 by Spectrophotometer
In DepthDetails ArticlePubMed
TargetInosine-5'-monophosphate dehydrogenase 1(Homo sapiens (Human))
University Of Minnesota
Curated by ChEMBL
LigandPNGBDBM50338553(6-(-4-((1-(((2S,3R,4S,5S)-5-(6-amino-9H-purin-9-yl...)
Affinity DataKi:  77nM. Assay description: Inhibition of human IMPDH1 by Spectrophotometry
In DepthDetails ArticlePubMed