BDBM50339079 (2R,3R,4S)-2-(6-amino-8-((E)-hex-1-enyl)-9H-purin-9-yl)tetrahydrothiophene-3,4-diol::CHEMBL1688381
SMILES CCCC\C=C\c1nc2c(N)ncnc2n1[C@@H]1SC[C@@H](O)[C@H]1O
InChI Key InChIKey=RHUKZCSJKNZBOF-GXDOZBQNSA-N
Data  1 KI
  Tab Delimited (TSV)   2D SDfile   Computed 3D by Vconf -m prep SDfile
Find this compound or compounds like it in BindingDB:
Activity Spreadsheet -- Enzyme Inhibition Constant Data from BindingDB
Found 1 hit for monomerid = 50339079
TargetAdenosine receptor A3(Homo sapiens (Human))
Ewha Womans University
Curated by ChEMBL
LigandPNGBDBM50339079((2R,3R,4S)-2-(6-amino-8-((E)-hex-1-enyl)-9H-purin-...)
Affinity DataKi:  259nM. Assay description: Displacement of [125I]I-AB-MECA from human adenosine A3 receptor expressed in CHO cells at 10 uM
In DepthDetails ArticlePubMed