BDBM50339855 6-(phenylamino)benzo[c][1,2]oxaborol-1(3H)-ol::CHEMBL1761260
SMILES OB1OCc2ccc(Nc3ccccc3)cc12
InChI Key InChIKey=CSONLIKZXPICDX-UHFFFAOYSA-N
Data  1 KI
  Tab Delimited (TSV)   2D SDfile   Computed 3D by Vconf -m prep SDfile
Find this compound or compounds like it in BindingDB:
Activity Spreadsheet -- Enzyme Inhibition Constant Data from BindingDB
Found 1 hit for monomerid = 50339855
TargetBeta-lactamase(Enterobacter cloacae)
Anacor Pharmaceuticals
Curated by ChEMBL
LigandPNGBDBM50339855(6-(phenylamino)benzo[c][1,2]oxaborol-1(3H)-ol | CH...)
Affinity DataKi:  4.73E+3nM. Assay description: Inhibition of Enterobacter cloacae P99 beta-lactamase AmpC P99 using nitrocefin as substrate after 30 mins by spectrophotometric analysis
In DepthDetails ArticlePubMed