BDBM50339944 1,1'-prop-1,3-diyl-bis(quinolinium)dibromide::CHEMBL1761991
SMILES C(C[n+]1cccc2ccccc12)C[n+]1cccc2ccccc12
InChI Key InChIKey=XKOPPJJSUOIQCM-UHFFFAOYSA-N
Data  2 IC50
  Tab Delimited (TSV)   2D SDfile   Computed 3D by Vconf -m prep SDfile
Find this compound or compounds like it in BindingDB:
Activity Spreadsheet -- Enzyme Inhibition Constant Data from BindingDB
Found 2 hits for monomerid = 50339944
TargetCholinesterase(Homo sapiens (Human))
Charles University
Curated by ChEMBL
LigandPNGBDBM50339944(1,1'-prop-1,3-diyl-bis(quinolinium)dibromide | CHE...)
Affinity DataIC50:  1.30E+4nM. Assay description: Inhibition of human plasmatic BChE by modified Ellman's method
In DepthDetails ArticlePubMed
TargetAcetylcholinesterase(Homo sapiens (Human))
Charles University
Curated by ChEMBL
LigandPNGBDBM50339944(1,1'-prop-1,3-diyl-bis(quinolinium)dibromide | CHE...)
Affinity DataIC50:  9.00E+3nM. Assay description: Inhibition of human erythrocyte recombinant AChE by modified Ellman's method
In DepthDetails ArticlePubMed