BDBM50339948 1,1'-hept-1,7-diyl-bis(quinolinium)dibromide::CHEMBL1761994
SMILES C(CCC[n+]1cccc2ccccc12)CCC[n+]1cccc2ccccc12
InChI Key InChIKey=BLMJGURMDNTUKU-UHFFFAOYSA-N
Data  2 IC50
  Tab Delimited (TSV)   2D SDfile   Computed 3D by Vconf -m prep SDfile
Find this compound or compounds like it in BindingDB:
Activity Spreadsheet -- Enzyme Inhibition Constant Data from BindingDB
Found 2 hits for monomerid = 50339948
TargetCholinesterase(Homo sapiens (Human))
Charles University
Curated by ChEMBL
LigandPNGBDBM50339948(1,1'-hept-1,7-diyl-bis(quinolinium)dibromide | CHE...)
Affinity DataIC50:  400nM. Assay description: Inhibition of human plasmatic BChE by modified Ellman's method
In DepthDetails ArticlePubMed
TargetAcetylcholinesterase(Homo sapiens (Human))
Charles University
Curated by ChEMBL
LigandPNGBDBM50339948(1,1'-hept-1,7-diyl-bis(quinolinium)dibromide | CHE...)
Affinity DataIC50:  90nM. Assay description: Inhibition of human erythrocyte recombinant AChE by modified Ellman's method
In DepthDetails ArticlePubMed