BDBM50342273 1-Acetyl-3H-naphtho[1,2,3-de]quinoline-2,7-dione::CHEMBL1529134
SMILES CC(=O)c1c2-c3ccccc3C(=O)c3cccc([nH]c1=O)c23
InChI Key InChIKey=KPCZTWRJINKFBD-UHFFFAOYSA-N
Data  1 IC50
  Tab Delimited (TSV)   2D SDfile   Computed 3D by Vconf -m prep SDfile
Find this compound or compounds like it in BindingDB:
Activity Spreadsheet -- Enzyme Inhibition Constant Data from BindingDB
Found 1 hit for monomerid = 50342273
TargetMitogen-activated protein kinase kinase kinase 5(Homo sapiens (Human))
Nas Of Ukraine
Curated by ChEMBL
LigandPNGBDBM50342273(1-Acetyl-3H-naphtho[1,2,3-de]quinoline-2,7-dione |...)
Affinity DataIC50:  1.50E+4nM. Assay description: Competitive inhibition of human ASK1
In DepthDetails ArticlePubMed