BDBM50342565 (E)-4-chloro-3-(2-oxo-2-(pyridin-3-yl)ethylidene)indolin-2-one::CHEMBL1770154
SMILES Clc1cccc2NC(=O)\C(=C\C(=O)c3cccnc3)c12
InChI Key InChIKey=PSPJWKKTYQVHMA-JXMROGBWSA-N
Data  1 KI  2 IC50
  Tab Delimited (TSV)   2D SDfile   Computed 3D by Vconf -m prep SDfile
Find this compound or compounds like it in BindingDB:
Activity Spreadsheet -- Enzyme Inhibition Constant Data from BindingDB
Found 3 hits for monomerid = 50342565
TargetProtein-glutamine gamma-glutamyltransferase 2(Homo sapiens (Human))
Stanford University
Curated by ChEMBL
LigandPNGBDBM50342565((E)-4-chloro-3-(2-oxo-2-(pyridin-3-yl)ethylidene)i...)
Affinity DataKi:  1.30E+3nM. Assay description: Inhibition of human transglutaminase 2 using Cbz-Gln-Gly as a substrate by GDH-coupled assay
In DepthDetails ArticlePubMed
TargetProtein-glutamine gamma-glutamyltransferase 2(Homo sapiens (Human))
Stanford University
Curated by ChEMBL
LigandPNGBDBM50342565((E)-4-chloro-3-(2-oxo-2-(pyridin-3-yl)ethylidene)i...)
Affinity DataIC50:  1.70E+3nM. Assay description: Inhibition of human transglutaminase 2 using ZGBC as a substrate after 30 to 60 mins by fluorometric assay
In DepthDetails ArticlePubMed
TargetProtein-glutamine gamma-glutamyltransferase 2(Homo sapiens (Human))
Stanford University
Curated by ChEMBL
LigandPNGBDBM50342565((E)-4-chloro-3-(2-oxo-2-(pyridin-3-yl)ethylidene)i...)
Affinity DataIC50:  900nM. Assay description: Inhibition of human transglutaminase 2 using Cbz-Gln-Gly as a substrate by GDH-coupled assay
In DepthDetails ArticlePubMed