BDBM50343045 (1R,2R,4S)-p-menthane-1,2,8-triol-1-O-beta-D-glucopyranoside::CHEMBL1770692
SMILES CC(C)(O)[C@H]1CC[C@@](C)(O[C@H]2O[C@@H](CO)[C@H](O)[C@@H](O)[C@@H]2O)[C@H](O)C1
InChI Key InChIKey=HWSOHMCMQHZNFN-NDRUJCHXSA-N
Data  2 IC50
  Tab Delimited (TSV)   2D SDfile   Computed 3D by Vconf -m prep SDfile
Find this compound or compounds like it in BindingDB:
Activity Spreadsheet -- Enzyme Inhibition Constant Data from BindingDB
Found 2 hits for monomerid = 50343045
TargetRibonuclease HI(Escherichia coli (strain K12))
Chungnam National University
Curated by ChEMBL
LigandPNGBDBM50343045((1R,2R,4S)-p-menthane-1,2,8-triol-1-O-beta-D-gluco...)
Affinity DataIC50: >2.00E+4nM. Assay description: Inhibition of Escherichia coli recombinant ribonuclease H after 30 mins by FRET quenching assay
In DepthDetails ArticlePubMed
TargetRibonuclease HI(Escherichia coli (strain K12))
Chungnam National University
Curated by ChEMBL
LigandPNGBDBM50343045((1R,2R,4S)-p-menthane-1,2,8-triol-1-O-beta-D-gluco...)
Affinity DataIC50: >2.00E+4nM. Assay description: Inhibition of Escherichia coli recombinant ribonuclease H after 30 mins by FRET quenching assay
In DepthDetails ArticlePubMed