BDBM50343748 1-((R)-9-Amino-22-((R)-9-amino-4-(2,2-diphenylacetamido)-1-(4-hydroxyphenyl)-3,11,18-trioxo-2,8,10,19-tetraazahenicos-9-en-21-yl)-4-(2,2-diphenylacetamido)-1-(4-hydroxyphenyl)-3,11,18-trioxo-2,8,10,19,22-pentaazatetracos-9-en-24-yl)-4-((E)-2-(1,2,3,5,6,7-hexahydropyrido[3,2,1-ij]quinolin-9-yl)ethenyl)-2,6-dimethylpyridinium tris(hydrotrifluoroacetate)::CHEMBL1774346
SMILES Cc1cc(C=Cc2cc3CCCN4CCCc(c2)c34)cc(C)[n+]1CCN(CCNC(=O)CCCCCCC(=O)NC(=N)NCCC[C@@H](NC(=O)C(c1ccccc1)c1ccccc1)C(=O)NCc1ccc(O)cc1)CCNC(=O)CCCCCCC(=O)NC(N)=NCCC[C@@H](NC(=O)C(c1ccccc1)c1ccccc1)C(=O)NCc1ccc(O)cc1
InChI Key InChIKey=FJKVCNJVYVDHMW-KARIZSNOSA-O
Data  1 KI
  Tab Delimited (TSV)   2D SDfile   Computed 3D by Vconf -m prep SDfile
Find this compound or compounds like it in BindingDB:
Activity Spreadsheet -- Enzyme Inhibition Constant Data from BindingDB
Found 1 hit for monomerid = 50343748
TargetNeuropeptide Y receptor type 1(Homo sapiens (Human))
Universit£T Regensburg
Curated by ChEMBL
LigandPNGBDBM50343748(1-((R)-9-Amino-22-((R)-9-amino-4-(2,2-diphenylacet...)
Affinity DataKi:  100nM. Assay description: Displacement of [3H]-UR-MK114 from Y1R in human SK-N-MC cells
In DepthDetails ArticlePubMed