BDBM50344669 6,8-dichloro-4-((5-(5-chloropyridin-2-yl)-4-(3,3,3-trifluoropropyl)-4H-1,2,4-triazol-3-yl)methyl)-2H-benzo[b][1,4]oxazin-3(4H)-one::CHEMBL1779217
SMILES FC(F)(F)CCn1c(CN2C(=O)COc3c(Cl)cc(Cl)cc23)nnc1-c1ccc(Cl)cn1
InChI Key InChIKey=DGJTZRUKRISFCY-UHFFFAOYSA-N
Data  1 IC50
  Tab Delimited (TSV)   2D SDfile   Computed 3D by Vconf -m prep SDfile
Find this compound or compounds like it in BindingDB:
Activity Spreadsheet -- Enzyme Inhibition Constant Data from BindingDB
Found 1 hit for monomerid = 50344669
TargetSodium/glucose cotransporter 2(Homo sapiens (Human))
Amgen
Curated by ChEMBL
LigandPNGBDBM50344669(6,8-dichloro-4-((5-(5-chloropyridin-2-yl)-4-(3,3,3...)
Affinity DataIC50:  3nM. Assay description: Inhibition of human SGLT2 expressed in CHO cells assessed as inhibition of [14C]-Glucose uptake using [14C]-methyl glucopyranoside after 60 mins by m...
In DepthDetails ArticlePubMed