BDBM50344678 6-chloro-4-((5-(5-chloropyridin-2-yl)-4-propyl-4H-1,2,4-triazol-3-yl)methyl)-8-nitro-2H-benzo[b][1,4]oxazin-3(4H)-one::CHEMBL1779338
SMILES CCCn1c(CN2C(=O)COc3c2cc(Cl)cc3[N+]([O-])=O)nnc1-c1ccc(Cl)cn1
InChI Key InChIKey=AAMMMTHCBLGALB-UHFFFAOYSA-N
Data  1 IC50
  Tab Delimited (TSV)   2D SDfile   Computed 3D by Vconf -m prep SDfile
Find this compound or compounds like it in BindingDB:
Activity Spreadsheet -- Enzyme Inhibition Constant Data from BindingDB
Found 1 hit for monomerid = 50344678
TargetSodium/glucose cotransporter 2(Homo sapiens (Human))
Amgen
Curated by ChEMBL
LigandPNGBDBM50344678(6-chloro-4-((5-(5-chloropyridin-2-yl)-4-propyl-4H-...)
Affinity DataIC50:  5nM. Assay description: Inhibition of human SGLT2 expressed in CHO cells assessed as inhibition of [14C]-Glucose uptake using [14C]-methyl glucopyranoside after 60 mins by m...
In DepthDetails ArticlePubMed