BDBM50344929 (R)-7-tert-butyl-1-(3,4-difluorobenzyl)-5-ethyl-2-(4-fluorophenyl)-7,8-dihydro-1H-imidazo[2,1-b]purin-4(5H)-one::CHEMBL1777935
SMILES CCN1C2=N[C@@H](CN2c2c(nc(-c3ccc(F)cc3)n2Cc2ccc(F)c(F)c2)C1=O)C(C)(C)C
InChI Key InChIKey=GYQNALPZKKTWQI-FQEVSTJZSA-N
Data  1 IC50
  Tab Delimited (TSV)   2D SDfile   Computed 3D by Vconf -m prep SDfile
Find this compound or compounds like it in BindingDB:
Activity Spreadsheet -- Enzyme Inhibition Constant Data from BindingDB
Found 1 hit for monomerid = 50344929
TargetP2X purinoceptor 7(Homo sapiens (Human))
Merck Research Laboratories
Curated by ChEMBL
LigandPNGBDBM50344929((R)-7-tert-butyl-1-(3,4-difluorobenzyl)-5-ethyl-2-...)
Affinity DataIC50:  41nM. Assay description: Antagonist activity at human P2X7 receptor by calcium flux assay
In DepthDetails ArticlePubMed