BDBM50344932 (R)-1-(cyclopentylmethyl)-5-ethyl-2-(4-fluorophenyl)-7-isopropyl-7,8-dihydro-1H-imidazo[2,1-b]purin-4(5H)-one::CHEMBL1777932
SMILES CCN1C2=N[C@@H](CN2c2c(nc(-c3ccc(F)cc3)n2CC2CCCC2)C1=O)C(C)C
InChI Key InChIKey=DNPCSHVBHYMBDX-IBGZPJMESA-N
Data  1 IC50
  Tab Delimited (TSV)   2D SDfile   Computed 3D by Vconf -m prep SDfile
Find this compound or compounds like it in BindingDB:
Activity Spreadsheet -- Enzyme Inhibition Constant Data from BindingDB
Found 1 hit for monomerid = 50344932
TargetP2X purinoceptor 7(Homo sapiens (Human))
Merck Research Laboratories
Curated by ChEMBL
LigandPNGBDBM50344932((R)-1-(cyclopentylmethyl)-5-ethyl-2-(4-fluoropheny...)
Affinity DataIC50:  114nM. Assay description: Antagonist activity at human P2X7 receptor by calcium flux assay
In DepthDetails ArticlePubMed