BDBM50344986 2-(5-chloro-4'-(ethylsulfonyl)-2'-fluorobiphenyl-2-yloxy)acetic acid::CHEMBL1778644
SMILES CCS(=O)(=O)c1ccc(c(F)c1)-c1cc(Cl)ccc1OCC(O)=O
InChI Key InChIKey=MNOSYFBXUCZGCA-UHFFFAOYSA-N
Data  2 IC50
  Tab Delimited (TSV)   2D SDfile   Computed 3D by Vconf -m prep SDfile
Find this compound or compounds like it in BindingDB:
Activity Spreadsheet -- Enzyme Inhibition Constant Data from BindingDB
Found 2 hits for monomerid = 50344986
TargetBile salt export pump(Homo sapiens (Human))
Astrazeneca
Curated by ChEMBL
LigandPNGBDBM50344986(2-(5-chloro-4'-(ethylsulfonyl)-2'-fluorobiphenyl-2...)
Affinity DataIC50:  1.68E+5nM. Assay description: Inhibition of human BSEP expressed in baculovirus transfected fall armyworm Sf21 cell membranes vesicles assessed as reduction in ATP-dependent [3H]-...
In DepthDetails ArticlePubMed
TargetProstaglandin D2 receptor 2(Homo sapiens (Human))
Astrazeneca R&D Charnwood
Curated by ChEMBL
LigandPNGBDBM50344986(2-(5-chloro-4'-(ethylsulfonyl)-2'-fluorobiphenyl-2...)
Affinity DataIC50:  7.90nM. Assay description: Displacement of [3H]-PGD2 from CRTh2 receptor by scintillation proximity assay
In DepthDetails ArticlePubMed