BDBM50345759 1-(4-Isopropyl benzenesulfonyl)-5-(piperazin-1-yl-methyl)-1H-indole::CHEMBL1785069
SMILES CC(C)c1ccc(cc1)S(=O)(=O)n1ccc2cc(CN3CCNCC3)ccc12
InChI Key InChIKey=ZCLMNAOXIFZSNT-UHFFFAOYSA-N
Data  1 KI
  Tab Delimited (TSV)   2D SDfile   Computed 3D by Vconf -m prep SDfile
Find this compound or compounds like it in BindingDB:
Activity Spreadsheet -- Enzyme Inhibition Constant Data from BindingDB
Found 1 hit for monomerid = 50345759
Target5-hydroxytryptamine receptor 6(Homo sapiens (Human))
TBA
Curated by ChEMBL
LigandPNGBDBM50345759(1-(4-Isopropyl benzenesulfonyl)-5-(piperazin-1-yl-...)
Affinity DataKi:  14.9nM. Assay description: Displacement of [3H]LSD from human 5HT6 receptor expressed in HEK293 cells
In DepthDetails ArticlePubMed