BDBM50346395 CHEMBL1783460::cis-3-(2-Phenyl-1,3-dioxan-4-yl)propan-1-amine
SMILES NCCC[C@@H]1CCO[C@@H](O1)c1ccccc1
InChI Key InChIKey=OCEQACROYVKLBC-OLZOCXBDSA-N
Data  1 KI
  Tab Delimited (TSV)   2D SDfile   Computed 3D by Vconf -m prep SDfile
Find this compound or compounds like it in BindingDB:
Activity Spreadsheet -- Enzyme Inhibition Constant Data from BindingDB
Found 1 hit for monomerid = 50346395
TargetSigma non-opioid intracellular receptor 1(Cavia porcellus (Guinea pig))
Westf£Lischen Wilhelms-Universit£T M£Nster
Curated by ChEMBL
LigandPNGBDBM50346395(CHEMBL1783460 | cis-3-(2-Phenyl-1,3-dioxan-4-yl)pr...)
Affinity DataKi:  167nM. Assay description: Displacement of [3H]-(+)-pentazocine from sigma 1 receptor PCP binding site in guinea pig brain by liquid scintillation counting
In DepthDetails ArticlePubMed