BDBM50347332 CHEMBL1796995
SMILES COc1ccc(cc1)-c1ccc(Cn2ccc3c2C(=O)NCCC3=NNc2ccccn2)cc1
InChI Key InChIKey=QRFGQFHWADPGFK-UHFFFAOYSA-N
Data  1 IC50
  Tab Delimited (TSV)   2D SDfile   Computed 3D by Vconf -m prep SDfile
Find this compound or compounds like it in BindingDB:
Activity Spreadsheet -- Enzyme Inhibition Constant Data from BindingDB
Found 1 hit for monomerid = 50347332
TargetTyrosine-protein phosphatase non-receptor type 1(Homo sapiens (Human))
Sun Yat-Sen University
Curated by ChEMBL
LigandPNGBDBM50347332(CHEMBL1796995)
Affinity DataIC50:  1.49E+4nM. Assay description: Inhibition of human recombinant PTP1B assessed as inhibition of para-nitrophenyl phosphate to para-nitrophenol conversion by spectrophotometry
In DepthDetails ArticlePubMed